{"text_format":"1","workbook":"xlsx","n_sheets":9,"sheets":["ProjectList","Instructions","Detail","Programs","SummaryPivot","Project Detail","Program Detail","GLTB","Student Accounts"],"not_rendered":{"charts":0,"images":6,"macros":1,"external_links":1,"defined_names":14,"comments":0,"pivot_tables":4},"unopened":[],"bounds":{"document_bytes":16777216,"sheet_cells":100000,"rows_first":2000,"rows_last":500,"rows_between":2000,"halvings":0,"cell_chars":16384,"cell_head_chars":4096},"cells_cut":0,"cells_raw":0,"read":"whole","date_system":"1900"}

{"sheet":"ProjectList","index":0,"n_rows":372,"n_cols":16,"rows_kept":372,"cut":false,"hidden":true,"merged":[]}
[null,null,null,null,null,null,null,null,null,null,"Encumbrance",null,null,null,"Object Codes"]
[{"$f":"IF(B2=\"\",\"\",MAX(A$1:A1)+1)","v":""},{"$f":"IF(B$1=Programs!$J2,Programs!K2,\"\")","v":""},null,{"$f":"IFERROR(INDEX($B$2:$B$199,MATCH(ROW()-ROW($D$1),$A$2:$A$199,0)),\"\")","v":""},null,null,null,null,null,null,"Budget",null,null,null,"VAL","DESCRIPTION"]
[{"$f":"IF(B3=\"\",\"\",MAX(A$1:A2)+1)","v":""},{"$f":"IF(B$1=Programs!$J3,Programs!K3,\"\")","v":""},null,"",null,null,null,null,null,null,null,null,null,null,"48891","Misc Revenue"]
[{"$f":"IF(B4=\"\",\"\",MAX(A$1:A3)+1)","v":""},{"$f":"IF(B$1=Programs!$J4,Programs!K4,\"\")","v":""},null,"",null,null,null,null,null,null,null,null,null,null,"48860","Misc Revenue"]
[{"$f":"IF(B5=\"\",\"\",MAX(A$1:A4)+1)","v":{"$error":"#REF!"}},{"$f":"IF(B$1=Programs!#REF!,Programs!#REF!,\"\")","v":{"$error":"#REF!"}},null,"",null,null,null,null,null,null,null,null,null,null,"48861","Misc Revenue"]
[{"$f":"IF(B6=\"\",\"\",MAX(A$1:A5)+1)","v":{"$error":"#REF!"}},{"$f":"IF(B$1=Programs!#REF!,Programs!#REF!,\"\")","v":{"$error":"#REF!"}},null,"",null,null,null,null,null,null,null,null,null,null,"48885","Misc Revenue"]
[{"$f":"IF(B7=\"\",\"\",MAX(A$1:A6)+1)","v":{"$error":"#REF!"}},{"$f":"IF(B$1=Programs!#REF!,Programs!#REF!,\"\")","v":{"$error":"#REF!"}},null,"",null,null,null,null,null,null,null,null,null,null,"51110","Instruc-Regular"]
[{"$f":"IF(B8=\"\",\"\",MAX(A$1:A7)+1)","v":{"$error":"#REF!"}},{"$f":"IF(B$1=Programs!#REF!,Programs!#REF!,\"\")","v":{"$error":"#REF!"}},null,"",null,null,null,null,null,null,null,null,null,null,"51170","Instruc-Sabb Lv"]
{"$rows_left_out":365}
{"sheet":"Instructions","index":1,"n_rows":37,"n_cols":13,"rows_kept":37,"cut":false,"hidden":false,"merged":[]}
[]
[null,null,null,null,null,null,null,null,null,null,null,"An Encumbrance Needs to have a Project"]
[null,null,null,null,null,"Ctrl m will bring up the Main Menu",null,null,null,null,null,"Projects have encumbrances not budget"]
[null,null,null,null,null,null,null,null,null,null,null,"The description can be changed at any time"]
["In Datatel ",null,null,null,null,null,null,null,null,null,null,"To change the budget for Operating Activity "]
[null,null,null,null,null,null,null,null,null,null,null,null,"First Change the main Budget"]
["Run General Ledger Trial Balance report",null,null,null,null,null,null,null,null,null,null,null,"Then change the Encumberance of the Object Code"]
[null,null,null,null,null,null,null,null,null,null,null,"Use Accounting Forms to verify Budget amounts"]
{"$rows_left_out":30}
{"sheet":"Detail","index":2,"n_rows":1076,"n_cols":10,"rows_kept":1076,"cut":false,"hidden":false,"merged":[]}
["Program","Account Number","Amount","Date","Type","Project","Description"]
["696546 FLOW","71-0000-1960-696546-55991",100000,"2021-07-01","Budget","FLOW "]
["696546 FLOW","71-0000-1960-696546-55991",30078.06,"2021-08-20","Encumbered","FLOW - Fall"," "]
["696546 FLOW","71-0000-1960-696546-55991",30078.06,"2021-07-01","Activity","FLOW - Fall","Winco Foods, Llc"]
["696503 ASMJC Presents","71-0000-1960-696503-55669",50000,"2021-07-01","Budget"]
["696504 Project LEAD","71-0000-1960-696504-55669",5500,"2021-07-01","Budget"]
["696505 Cult Div & Ethnic Prog","71-0000-1960-696505-55669",40000,"2021-07-01","Budget"]
["696530 Oper Activities","71-0000-1960-696530-52110",50000,"2021-07-01","Budget","NonInstruc-Reg","NonInstruc-Reg"]
{"$rows_left_out":1069}
{"sheet":"Programs","index":3,"n_rows":18,"n_cols":13,"rows_kept":18,"cut":false,"hidden":false,"merged":[]}
["Program","Activity Code","Description",null,null,null,null,null,null,"Programs","Projects","Orignial\nEncumberance","Description"]
[{"$f":"+Table3[[#This Row],[Activity Code]]&\" \"&Table3[[#This Row],[Description]]","v":"696264 AS-Synergy Club"},696264,"AS-Synergy Club",null,null,null,null,null,null,"696546 FLOW","FLOW - Fall",50000]
[{"$f":"+Table3[[#This Row],[Activity Code]]&\" \"&Table3[[#This Row],[Description]]","v":"696503 ASMJC Presents"},696503,"ASMJC Presents",null,null,null,null,null,null,"696530 Operating Activity","Leadership Retreat",5000,"E00383"]
[{"$f":"+Table3[[#This Row],[Activity Code]]&\" \"&Table3[[#This Row],[Description]]","v":"696504 Project LEAD"},696504,"Project LEAD",null,null,null,null,null,null,"696503 ASMJC Presents","Welcome Week",5000,"E00384"]
[{"$f":"+Table3[[#This Row],[Activity Code]]&\" \"&Table3[[#This Row],[Description]]","v":"696505 Diversity "},696505,"Diversity "]
[{"$f":"+Table3[[#This Row],[Activity Code]]&\" \"&Table3[[#This Row],[Description]]","v":"696512 Marketing "},696512,"Marketing "]
[{"$f":"+Table3[[#This Row],[Activity Code]]&\" \"&Table3[[#This Row],[Description]]","v":"696513 Senator Projects"},696513,"Senator Projects"]
[{"$f":"+Table3[[#This Row],[Activity Code]]&\" \"&Table3[[#This Row],[Description]]","v":"696530 Operating Activity"},696530,"Operating Activity"]
{"$rows_left_out":11}
{"sheet":"SummaryPivot","index":4,"n_rows":200,"n_cols":8,"rows_kept":200,"cut":false,"hidden":false,"merged":[]}
["ASMJC Program Report"]
["As of:  ",{"$f":"MAX(Table5[[ Date]])","v":"2021-08-18"}]
[]
[]
[]
["Sum of Amount",null,"Type",null,null,"Budget","Budget","Encumbrance"]
["Program","Project","Budget","Encumbered","Activity","Less Encumbrance","Less Activity","Less Activity"]
["696530 Operating Activity",null,null,null,5245.4700000000012,{"$f":"IF(RIGHT(A8,5)=\"Total\",C8-D8,IF(AND(C8>0,RIGHT(A8,5)<>\"Total\"),C8-IFERROR(GETPIVOTDATA(\"Amount\",$A$6,\"Program\",A8,\"Type\",\"Encumbered\"),0),\"\"))","v":""},{"$f":"IF(RIGHT(A8,5)=\"Total\",C8-E8,IF(C8>0,C8-IFERROR(GETPIVOTDATA(\"Amount\",$A$6,\"Program\",A8,\"Type\",\"Activity\"),0),\"\"))","v":""},{"$f":"IF(AND(CELL(\"type\",D8)=\"b\",CELL(\"type\",E8)=\"b\"),\"\",ROUND(D8-E8,2))","v":-5245.47}]
{"$rows_left_out":193}
{"sheet":"Project Detail","index":5,"n_rows":400,"n_cols":7,"rows_kept":400,"cut":false,"hidden":false,"merged":[]}
[{"$f":"+SummaryPivot!A2","v":"As of:  "},{"$f":"MAX(Table5[[ Date]])","v":"2021-08-18"},null,null,null,"Budget Less Activity",{"$f":"+GETPIVOTDATA(\"Amount\",$A$4,\"Type\",\"Budget\")-IFERROR(GETPIVOTDATA(\"Amount\",$A$4,\"Type\",\"Activity\"),0)","v":401659.17}]
["Program","(All)"]
[]
["Sum of Amount",null,null,"Type",null,null,"Encumbrance"]
["Project","Date","Description","Budget","Encumbered","Activity","less Activity"]
["NonInstuc-Reg",null,null,null,null,2814,{"$f":"IF(CELL(\"type\",B6)=\"b\",IF(AND(CELL(\"type\",E6)=\"b\",CELL(\"type\",F6)=\"b\"),\"\",IF(CELL(\"type\",C6)=\"l\",\"\",ROUND(E6-F6,2))),\"\")","v":-2814}]
[null,null,null,null,null,null,{"$f":"IF(CELL(\"type\",B7)=\"b\",IF(AND(CELL(\"type\",E7)=\"b\",CELL(\"type\",F7)=\"b\"),\"\",IF(CELL(\"type\",C7)=\"l\",\"\",ROUND(E7-F7,2))),\"\")","v":""}]
["Services-Repair/Maintenance",null,null,5000,null,80.13,{"$f":"IF(CELL(\"type\",B8)=\"b\",IF(AND(CELL(\"type\",E8)=\"b\",CELL(\"type\",F8)=\"b\"),\"\",IF(CELL(\"type\",C8)=\"l\",\"\",ROUND(E8-F8,2))),\"\")","v":-80.13}]
{"$rows_left_out":393}
{"sheet":"Program Detail","index":6,"n_rows":288,"n_cols":8,"rows_kept":288,"cut":false,"hidden":false,"merged":[]}
["Total Budget",{"$f":"IFERROR(GETPIVOTDATA(\"Amount\",$A$7,\"Type\",\"Budget\"),\"\")","v":439000},null,"Total Budget",null,{"$f":"IFERROR(GETPIVOTDATA(\"Amount\",$A$7,\"Type\",\"Budget\"),\"\")","v":439000}]
["Total Encumbered",{"$f":"IFERROR(GETPIVOTDATA(\"Amount\",$A$7,\"Type\",\"Encumbrance\"),\"\")","v":""},null,"Total Activity",null,{"$f":"IFERROR(GETPIVOTDATA(\"Amount\",$A$7,\"Type\",\"Activity\"),0)","v":37340.83}]
["Available",{"$f":"IFERROR(B1-B2,\"\")","v":""},null,"Balance",null,{"$f":"IFERROR(IFERROR(F1-F2,B2-F2),\"\")","v":401659.17}]
[{"$f":"+SummaryPivot!A2&MONTH(SummaryPivot!B2)&\"/\"&DAY(SummaryPivot!B2)&\"/\"&YEAR(SummaryPivot!B2)","v":"As of:  8/18/2021"}]
[]
[]
["Sum of Amount",null,"Type",null,null,"Budget less","Budget less","Encumbrance"]
["Program","Project","Budget","Encumbered","Activity","Encumbrance","Activity","Less Activity"]
{"$rows_left_out":281}
{"sheet":"GLTB","index":7,"n_rows":218,"n_cols":14,"rows_kept":218,"cut":false,"hidden":false,"merged":[]}
["GL Account"," GL Description"," Date"," Source"," Reference Number"," Description"," Opening Balance"," YTD Debits"," YTD Credits","Amount","0","Object","Difference","Project\nNeeded"]
["71-0000-1960-696200-29512","Gen : A/P-Current : AS-A/P : Stdnt Development/Campus Life : Assoc Students","2021-07-01","PJ","'V1266758'","Winco Foods, Llc",null,null,30078.06,{"$f":"IF(MID(A2,21,1)=\"2\",-G2-H2+I2,IF(SUM(H2:I2)>0,H2-I2,\"\"))","v":30078.06},{"$f":"IF(MID(Table5[[#This Row],[GL Account]],21,1)=\"2\",MID(Table5[[#This Row],[ GL Description]],FIND(\":\",Table5[[#This Row],[ GL Description]],1)+2,FIND(\":\",Table5[[#This Row],[ GL Description]],FIND(\":\",Table5[[#This Row],[ GL Description]],1)+1)-FIND(\":\",Table5[[#This Row],[ GL Description]],1)-2),VLOOKUP(VALUE(MID(Table5[[#This Row],[GL Account]],14,6)),PgmList,2,FALSE))","v":"A/P-Current "},{"$f":"IF(MID(A2,21,1)=\"2\",MID(A2,14,6)&\" - \"&MID(B2,FIND(\":\",B2,FIND(K2,B2,1))+2,FIND(\":\",B2,FIND(\":\",B2,FIND(K2,B2,1))+1)-FIND(\":\",B2,FIND(K2,B2,1))-2),IF(AND(MID(Table5[[#This Row],[GL Account]],14,6)<>\"696530\",MID(Table5[[#This Row],[GL Account]],14,6)<>\"696570\"),\"\",IF(MID(Table5[[#This Row],[GL Account]],21,2)=\"53\",\"Fringe Benefits\",VLOOKUP(RIGHT(Table5[[#This Row],[GL Account]],5),Object,2,FALSE))))&IF(RIGHT(Table5[[#This Row],[GL Account]],5)=\"29599\",IF(MID(A2,4,4)=\"0000\",\"\",\" \"&MID(A2,4,4))&\" - \"&LEFT(Table5[[#This Row],[ GL Description]],FIND(\" : \",Table5[[#This Row],[ GL Description]])),\"\")","v":"696200 - AS-A/P "},{"$f":"IF(MID(A2,21,1)=\"2\",0,IF(OR(MID(Table5[[#This Row],[GL Account]],14,6)=\"696520\",AND(MID(A2,14,6)=\"696530\",MID(Table5[[#This Row],[GL Account]],21,1)=\"4\")),0,ROUND(SUMIF(Table5[GL Account],Table5[[#This Row],[GL Account]],Table5[Amount])-SUMIFS(Table2[Amount],Table2[Type],\"Activity\",Table2[Account Number],GLTB!A2),2)))","v":0},{"$f":"IF(Table5[[#This Row],[Difference]]=0,\"\",IF(ISNA(VLOOKUP(Table5[[#This Row],[0]],Table1[],1,FALSE)),\"\",\"X\"))","v":""}]
["71-0000-1960-696200-29512","Gen : A/P-Current : AS-A/P : Stdnt Development/Campus Life : Assoc Students","2021-07-06","CD","'MF*0103811'","United Site Services",null,137.80000000000001,null,-137.80000000000001,{"$f":"IF(MID(Table5[[#This Row],[GL Account]],21,1)=\"2\",MID(Table5[[#This Row],[ GL Description]],FIND(\":\",Table5[[#This Row],[ GL Description]],1)+2,FIND(\":\",Table5[[#This Row],[ GL Description]],FIND(\":\",Table5[[#This Row],[ GL Description]],1)+1)-FIND(\":\",Table5[[#This Row],[ GL Description]],1)-2),VLOOKUP(VALUE(MID(Table5[[#This Row],[GL Account]],14,6)),PgmList,2,FALSE))","v":"A/P-Current "},{"$f":"IF(MID(A3,21,1)=\"2\",MID(A3,14,6)&\" - \"&MID(B3,FIND(\":\",B3,FIND(K3,B3,1))+2,FIND(\":\",B3,FIND(\":\",B3,FIND(K3,B3,1))+1)-FIND(\":\",B3,FIND(K3,B3,1))-2),IF(AND(MID(Table5[[#This Row],[GL Account]],14,6)<>\"696530\",MID(Table5[[#This Row],[GL Account]],14,6)<>\"696570\"),\"\",IF(MID(Table5[[#This Row],[GL Account]],21,2)=\"53\",\"Fringe Benefits\",VLOOKUP(RIGHT(Table5[[#This Row],[GL Account]],5),Object,2,FALSE))))&IF(RIGHT(Table5[[#This Row],[GL Account]],5)=\"29599\",IF(MID(A3,4,4)=\"0000\",\"\",\" \"&MID(A3,4,4))&\" - \"&LEFT(Table5[[#This Row],[ GL Description]],FIND(\" : \",Table5[[#This Row],[ GL Description]])),\"\")","v":"696200 - AS-A/P "},{"$f":"IF(MID(A3,21,1)=\"2\",0,IF(OR(MID(Table5[[#This Row],[GL Account]],14,6)=\"696520\",AND(MID(A3,14,6)=\"696530\",MID(Table5[[#This Row],[GL Account]],21,1)=\"4\")),0,ROUND(SUMIF(Table5[GL Account],Table5[[#This Row],[GL Account]],Table5[Amount])-SUMIFS(Table2[Amount],Table2[Type],\"Activity\",Table2[Account Number],GLTB!A3),2)))","v":0},{"$f":"IF(Table5[[#This Row],[Difference]]=0,\"\",IF(ISNA(VLOOKUP(Table5[[#This Row],[0]],Table1[],1,FALSE)),\"\",\"X\"))","v":""}]
["71-0000-1960-696200-29512","Gen : A/P-Current : AS-A/P : Stdnt Development/Campus Life : Assoc Students","2021-07-13","PJ","'V1269413'","United Site Services",null,null,137.80000000000001,137.80000000000001,{"$f":"IF(MID(Table5[[#This Row],[GL Account]],21,1)=\"2\",MID(Table5[[#This Row],[ GL Description]],FIND(\":\",Table5[[#This Row],[ GL Description]],1)+2,FIND(\":\",Table5[[#This Row],[ GL Description]],FIND(\":\",Table5[[#This Row],[ GL Description]],1)+1)-FIND(\":\",Table5[[#This Row],[ GL Description]],1)-2),VLOOKUP(VALUE(MID(Table5[[#This Row],[GL Account]],14,6)),PgmList,2,FALSE))","v":"A/P-Current "},{"$f":"IF(MID(A4,21,1)=\"2\",MID(A4,14,6)&\" - \"&MID(B4,FIND(\":\",B4,FIND(K4,B4,1))+2,FIND(\":\",B4,FIND(\":\",B4,FIND(K4,B4,1))+1)-FIND(\":\",B4,FIND(K4,B4,1))-2),IF(AND(MID(Table5[[#This Row],[GL Account]],14,6)<>\"696530\",MID(Table5[[#This Row],[GL Account]],14,6)<>\"696570\"),\"\",IF(MID(Table5[[#This Row],[GL Account]],21,2)=\"53\",\"Fringe Benefits\",VLOOKUP(RIGHT(Table5[[#This Row],[GL Account]],5),Object,2,FALSE))))&IF(RIGHT(Table5[[#This Row],[GL Account]],5)=\"29599\",IF(MID(A4,4,4)=\"0000\",\"\",\" \"&MID(A4,4,4))&\" - \"&LEFT(Table5[[#This Row],[ GL Description]],FIND(\" : \",Table5[[#This Row],[ GL Description]])),\"\")","v":"696200 - AS-A/P "},{"$f":"IF(MID(A4,21,1)=\"2\",0,IF(OR(MID(Table5[[#This Row],[GL Account]],14,6)=\"696520\",AND(MID(A4,14,6)=\"696530\",MID(Table5[[#This Row],[GL Account]],21,1)=\"4\")),0,ROUND(SUMIF(Table5[GL Account],Table5[[#This Row],[GL Account]],Table5[Amount])-SUMIFS(Table2[Amount],Table2[Type],\"Activity\",Table2[Account Number],GLTB!A4),2)))","v":0},{"$f":"IF(Table5[[#This Row],[Difference]]=0,\"\",IF(ISNA(VLOOKUP(Table5[[#This Row],[0]],Table1[],1,FALSE)),\"\",\"X\"))","v":""}]
["71-0000-1960-696200-29512","Gen : A/P-Current : AS-A/P : Stdnt Development/Campus Life : Assoc Students","2021-07-14","PJ","'V1267220'","Maria Delcarmen De la Cruz",null,null,900,900,{"$f":"IF(MID(Table5[[#This Row],[GL Account]],21,1)=\"2\",MID(Table5[[#This Row],[ GL Description]],FIND(\":\",Table5[[#This Row],[ GL Description]],1)+2,FIND(\":\",Table5[[#This Row],[ GL Description]],FIND(\":\",Table5[[#This Row],[ GL Description]],1)+1)-FIND(\":\",Table5[[#This Row],[ GL Description]],1)-2),VLOOKUP(VALUE(MID(Table5[[#This Row],[GL Account]],14,6)),PgmList,2,FALSE))","v":"A/P-Current "},{"$f":"IF(MID(A5,21,1)=\"2\",MID(A5,14,6)&\" - \"&MID(B5,FIND(\":\",B5,FIND(K5,B5,1))+2,FIND(\":\",B5,FIND(\":\",B5,FIND(K5,B5,1))+1)-FIND(\":\",B5,FIND(K5,B5,1))-2),IF(AND(MID(Table5[[#This Row],[GL Account]],14,6)<>\"696530\",MID(Table5[[#This Row],[GL Account]],14,6)<>\"696570\"),\"\",IF(MID(Table5[[#This Row],[GL Account]],21,2)=\"53\",\"Fringe Benefits\",VLOOKUP(RIGHT(Table5[[#This Row],[GL Account]],5),Object,2,FALSE))))&IF(RIGHT(Table5[[#This Row],[GL Account]],5)=\"29599\",IF(MID(A5,4,4)=\"0000\",\"\",\" \"&MID(A5,4,4))&\" - \"&LEFT(Table5[[#This Row],[ GL Description]],FIND(\" : \",Table5[[#This Row],[ GL Description]])),\"\")","v":"696200 - AS-A/P "},{"$f":"IF(MID(A5,21,1)=\"2\",0,IF(OR(MID(Table5[[#This Row],[GL Account]],14,6)=\"696520\",AND(MID(A5,14,6)=\"696530\",MID(Table5[[#This Row],[GL Account]],21,1)=\"4\")),0,ROUND(SUMIF(Table5[GL Account],Table5[[#This Row],[GL Account]],Table5[Amount])-SUMIFS(Table2[Amount],Table2[Type],\"Activity\",Table2[Account Number],GLTB!A5),2)))","v":0},{"$f":"IF(Table5[[#This Row],[Difference]]=0,\"\",IF(ISNA(VLOOKUP(Table5[[#This Row],[0]],Table1[],1,FALSE)),\"\",\"X\"))","v":""}]
["71-0000-1960-696200-29512","Gen : A/P-Current : AS-A/P : Stdnt Development/Campus Life : Assoc Students","2021-07-14","PJ","'V1267222'","John I. Griffin, III",null,null,500,500,{"$f":"IF(MID(Table5[[#This Row],[GL Account]],21,1)=\"2\",MID(Table5[[#This Row],[ GL Description]],FIND(\":\",Table5[[#This Row],[ GL Description]],1)+2,FIND(\":\",Table5[[#This Row],[ GL Description]],FIND(\":\",Table5[[#This Row],[ GL Description]],1)+1)-FIND(\":\",Table5[[#This Row],[ GL Description]],1)-2),VLOOKUP(VALUE(MID(Table5[[#This Row],[GL Account]],14,6)),PgmList,2,FALSE))","v":"A/P-Current "},{"$f":"IF(MID(A6,21,1)=\"2\",MID(A6,14,6)&\" - \"&MID(B6,FIND(\":\",B6,FIND(K6,B6,1))+2,FIND(\":\",B6,FIND(\":\",B6,FIND(K6,B6,1))+1)-FIND(\":\",B6,FIND(K6,B6,1))-2),IF(AND(MID(Table5[[#This Row],[GL Account]],14,6)<>\"696530\",MID(Table5[[#This Row],[GL Account]],14,6)<>\"696570\"),\"\",IF(MID(Table5[[#This Row],[GL Account]],21,2)=\"53\",\"Fringe Benefits\",VLOOKUP(RIGHT(Table5[[#This Row],[GL Account]],5),Object,2,FALSE))))&IF(RIGHT(Table5[[#This Row],[GL Account]],5)=\"29599\",IF(MID(A6,4,4)=\"0000\",\"\",\" \"&MID(A6,4,4))&\" - \"&LEFT(Table5[[#This Row],[ GL Description]],FIND(\" : \",Table5[[#This Row],[ GL Description]])),\"\")","v":"696200 - AS-A/P "},{"$f":"IF(MID(A6,21,1)=\"2\",0,IF(OR(MID(Table5[[#This Row],[GL Account]],14,6)=\"696520\",AND(MID(A6,14,6)=\"696530\",MID(Table5[[#This Row],[GL Account]],21,1)=\"4\")),0,ROUND(SUMIF(Table5[GL Account],Table5[[#This Row],[GL Account]],Table5[Amount])-SUMIFS(Table2[Amount],Table2[Type],\"Activity\",Table2[Account Number],GLTB!A6),2)))","v":0},{"$f":"IF(Table5[[#This Row],[Difference]]=0,\"\",IF(ISNA(VLOOKUP(Table5[[#This Row],[0]],Table1[],1,FALSE)),\"\",\"X\"))","v":""}]
["71-0000-1960-696200-29512","Gen : A/P-Current : AS-A/P : Stdnt Development/Campus Life : Assoc Students","2021-07-14","PJ","'V1267223'","Rebecca A. Tilger",null,null,300,300,{"$f":"IF(MID(Table5[[#This Row],[GL Account]],21,1)=\"2\",MID(Table5[[#This Row],[ GL Description]],FIND(\":\",Table5[[#This Row],[ GL Description]],1)+2,FIND(\":\",Table5[[#This Row],[ GL Description]],FIND(\":\",Table5[[#This Row],[ GL Description]],1)+1)-FIND(\":\",Table5[[#This Row],[ GL Description]],1)-2),VLOOKUP(VALUE(MID(Table5[[#This Row],[GL Account]],14,6)),PgmList,2,FALSE))","v":"A/P-Current "},{"$f":"IF(MID(A7,21,1)=\"2\",MID(A7,14,6)&\" - \"&MID(B7,FIND(\":\",B7,FIND(K7,B7,1))+2,FIND(\":\",B7,FIND(\":\",B7,FIND(K7,B7,1))+1)-FIND(\":\",B7,FIND(K7,B7,1))-2),IF(AND(MID(Table5[[#This Row],[GL Account]],14,6)<>\"696530\",MID(Table5[[#This Row],[GL Account]],14,6)<>\"696570\"),\"\",IF(MID(Table5[[#This Row],[GL Account]],21,2)=\"53\",\"Fringe Benefits\",VLOOKUP(RIGHT(Table5[[#This Row],[GL Account]],5),Object,2,FALSE))))&IF(RIGHT(Table5[[#This Row],[GL Account]],5)=\"29599\",IF(MID(A7,4,4)=\"0000\",\"\",\" \"&MID(A7,4,4))&\" - \"&LEFT(Table5[[#This Row],[ GL Description]],FIND(\" : \",Table5[[#This Row],[ GL Description]])),\"\")","v":"696200 - AS-A/P "},{"$f":"IF(MID(A7,21,1)=\"2\",0,IF(OR(MID(Table5[[#This Row],[GL Account]],14,6)=\"696520\",AND(MID(A7,14,6)=\"696530\",MID(Table5[[#This Row],[GL Account]],21,1)=\"4\")),0,ROUND(SUMIF(Table5[GL Account],Table5[[#This Row],[GL Account]],Table5[Amount])-SUMIFS(Table2[Amount],Table2[Type],\"Activity\",Table2[Account Number],GLTB!A7),2)))","v":0},{"$f":"IF(Table5[[#This Row],[Difference]]=0,\"\",IF(ISNA(VLOOKUP(Table5[[#This Row],[0]],Table1[],1,FALSE)),\"\",\"X\"))","v":""}]
["71-0000-1960-696200-29512","Gen : A/P-Current : AS-A/P : Stdnt Development/Campus Life : Assoc Students","2021-07-20","CD","'MF*0103812'","Maria Delcarmen De la Cruz",null,900,null,-900,{"$f":"IF(MID(Table5[[#This Row],[GL Account]],21,1)=\"2\",MID(Table5[[#This Row],[ GL Description]],FIND(\":\",Table5[[#This Row],[ GL Description]],1)+2,FIND(\":\",Table5[[#This Row],[ GL Description]],FIND(\":\",Table5[[#This Row],[ GL Description]],1)+1)-FIND(\":\",Table5[[#This Row],[ GL Description]],1)-2),VLOOKUP(VALUE(MID(Table5[[#This Row],[GL Account]],14,6)),PgmList,2,FALSE))","v":"A/P-Current "},{"$f":"IF(MID(A8,21,1)=\"2\",MID(A8,14,6)&\" - \"&MID(B8,FIND(\":\",B8,FIND(K8,B8,1))+2,FIND(\":\",B8,FIND(\":\",B8,FIND(K8,B8,1))+1)-FIND(\":\",B8,FIND(K8,B8,1))-2),IF(AND(MID(Table5[[#This Row],[GL Account]],14,6)<>\"696530\",MID(Table5[[#This Row],[GL Account]],14,6)<>\"696570\"),\"\",IF(MID(Table5[[#This Row],[GL Account]],21,2)=\"53\",\"Fringe Benefits\",VLOOKUP(RIGHT(Table5[[#This Row],[GL Account]],5),Object,2,FALSE))))&IF(RIGHT(Table5[[#This Row],[GL Account]],5)=\"29599\",IF(MID(A8,4,4)=\"0000\",\"\",\" \"&MID(A8,4,4))&\" - \"&LEFT(Table5[[#This Row],[ GL Description]],FIND(\" : \",Table5[[#This Row],[ GL Description]])),\"\")","v":"696200 - AS-A/P "},{"$f":"IF(MID(A8,21,1)=\"2\",0,IF(OR(MID(Table5[[#This Row],[GL Account]],14,6)=\"696520\",AND(MID(A8,14,6)=\"696530\",MID(Table5[[#This Row],[GL Account]],21,1)=\"4\")),0,ROUND(SUMIF(Table5[GL Account],Table5[[#This Row],[GL Account]],Table5[Amount])-SUMIFS(Table2[Amount],Table2[Type],\"Activity\",Table2[Account Number],GLTB!A8),2)))","v":0},{"$f":"IF(Table5[[#This Row],[Difference]]=0,\"\",IF(ISNA(VLOOKUP(Table5[[#This Row],[0]],Table1[],1,FALSE)),\"\",\"X\"))","v":""}]
{"$rows_left_out":211}
{"sheet":"Student Accounts","index":8,"n_rows":74,"n_cols":4,"rows_kept":74,"cut":false,"hidden":false,"merged":[]}
[]
[]
[null,null,{"$f":"+SummaryPivot!A2","v":"As of:  "},{"$f":"MAX(Table5[[ Date]])","v":"2021-08-18"}]
[]
["Object"," Date","Sum of Amount"]
["696222 - AS-A/P-Region V CALSACC ",null,3185.58]
["696223 - AS-A/P-Nursing Reunion ",null,759.93]
["696230 - AS-Freedom Forum  - Gen ",null,2582.87]
{"$rows_left_out":66}